• 締切済み
  • すぐに回答を!

libxml2のmakeでエラー

phpをインストールする前にlibxml2が必要らしいのでインストールすることにしたのですが、make時にエラー出てしまいました。 検索したのですが自分では検討がつきません…。どのような原因なのか教えてください。 OS:fedora core 6 wget -P /usr/local/src ftp://xmlsoft.org/libxml2/libxml2-2.6.27.tar.gz # cd /usr/local/src # tar xzf libxml2-2.6.27.tar.gz # cd libxml2-2.6.27 # ./configure --prefix=/usr/local --with-low-memory # make parser.c:5103: internal compiler error: Aborted Please submit a full bug report, with preprocessed source if appropriate. See <URL:http://bugzilla.redhat.com/bugzilla> for instructions. The bug is not reproducible, so it is likely a hardware or OS problem. make[2]: *** [parser.lo] Error 1 make[2]: Leaving directory `/usr/local/src/libxml2-2.6.27' make[1]: *** [all-recursive] Error 1 make[1]: Leaving directory `/usr/local/src/libxml2-2.6.27' make: *** [all] Error 2 ちなみにlinuxをのせてるPCはwindowsMe時代の奴でテキストモードでしかfedora6をインストールできないようなしょぼい奴です。 基本的にソースでインストールする勉強をしているのでソースから入れようと思ってます。 mysqlのmake時にには下のようなエラーがでました。 make[2]: *** [my_write.lo] Error 1 make[2]: Leaving directory `/home/mysql/src/mysql-5.1.22-rc/libmysql' make[1]: *** [all] Error 2 make[1]: Leaving directory `/home/mysql/src/mysql-5.1.22-rc/libmysql' make: *** [all-recursive] Error 1 こちらもどこが怪しいか指摘くださると助かります。

共感・応援の気持ちを伝えよう!

  • 回答数1
  • 閲覧数1282
  • ありがとう数1

みんなの回答

  • 回答No.1
noname#58816
noname#58816

エラーメッセージ、もっと出てるはずなんですが、本当にそれしかでてないんですか? この情報だけだと、"知らんがな"としか言えません。

共感・感謝の気持ちを伝えよう!

質問者からのお礼

そうですね。 yum updateで全体的にupdateしたらうまくいったみたいです。

関連するQ&A

  • MYSQLのmakeができない!(Redhat9、Mysql_4.0.17)

    MYSQLをインストールして./configureまで完了したのですが、makeすると以下のようになります。 make[2]: *** [libmysql.lo] エラー 1 make[2]: 出ます ディレクトリ `/usr/local/src/mysql-4.0.17/libmysql' make[1]: *** [all-recursive] エラー 1 make[1]: 出ます ディレクトリ `/usr/local/src/mysql-4.0.17' make: *** [all] エラー 2 apacheは失敗続きもインストールできたのですが 上記は何を意味しているのでしょうか?

  • Apache インストール時のエラーについて

    CentOS4.6 に Apacheをインストールしようとしているのですが、make と make install で いつも このようなエラーがでて。。どうも上手いこといきません。  まだ初心者なので訳してみてもよくわからず、調べた結果、 /usr/local/apache/bin/ に apachectl が何度も挑戦しても、 作成されません。なぜでしょう・・・助けてください。 ※元々、OSインストール時にhttpdがインストールされてましたので、 yum remove httpdを実行しました。(元々のでも出来なかったので) 後、最終的にしたいことは、htdocsを作成してCGIとかperl とかで勉強したいのですが、apacheが、、、お願いします。 /usr/lib/libexpat.so: could not read symbols: File in wrong format collect2: ld returned 1 exit status make[3]: *** [libaprutil-1.la] Error 1 make[3]: Leaving directory `/usr/local/src/httpd-2.2.8/srclib/apr-util' make[2]: *** [all-recursive] Error 1 make[2]: Leaving directory `/usr/local/src/httpd-2.2.8/srclib/apr-util' make[1]: *** [all-recursive] Error 1 make[1]: Leaving directory `/usr/local/src/httpd-2.2.8/srclib' make: *** [all-recursive] Error 1

  • Apache2のインストールに失敗する

    Solaris9でサーバを構築しています。Apache2をソースからインストールしようと考えていますが、makeすると以下のようなエラーが出てしまいます。 どのように対処したらよいでしょうか? ご教授お願いいたします。 make[2]: *** [exports.lo] Error 1 make[2]: Leaving directory `/usr/local/src/httpd-2.0.54/server' make[1]: *** [all-recursive] Error 1 make[1]: Leaving directory `/usr/local/src/httpd-2.0.54/server' make: *** [all-recursive] Error 1

  • 日本語係り受け解析器CaboChaのmakeに失敗する

    日本語係り受け解析器CaboChaをインストールしたいのですが、makeに失敗します。 makeを成功させるには何が必要なのでしょうか? お知恵を貸して下さい。 コンパイル環境 OS CentOS3 g++ 3.2.5 cabocha-0.60pre2 CRF++-0.51 make失敗時に表示されたエラーメッセージです。 g++ -DHAVE_CONFIG_H -I. -I.. -DCABOCHA_DEFAULT_POSSET=\"IPA\" -DCABOCHA_DEFAULT_CHARSET=\"UTF8\" -DMODEL_VERSION=100 -DCABOCHA_DEFAULT_RC=\"/usr/local/etc/cabocharc\" -O3 -Wno-deprecated -Wall -c chunk_learner.cpp -fPIC -DPIC -o .libs/chunk_learner.o chunk_learner.cpp: In function `bool CaboCha::ChunkingTrainingWithCRFPP(cabocha_parser_t, cabocha_charset_t, cabocha_posset_t, int, const char*, const char*, const char*)': chunk_learner.cpp:162: `::unlink' undeclared (first use here) make[2]: *** [chunk_learner.lo] Error 1 make[2]: Leaving directory `/usr/local/src/cabocha-0.60pre2/src' make[1]: *** [all-recursive] Error 1 make[1]: Leaving directory `/usr/local/src/cabocha-0.60pre2' make: *** [all] Error 2

  • Apacheのインストール

    相当初心者で申し訳ありませんが、Fedora Core5より 新規でApacheをインストールする事が出来ません。 tar zxvf apache_1.3.36.tar.gz mv apache_1.3.36 httpd cd ./httpd ./configure make make install としたところ、 make[1]: Entering directory '/usr/local/src/httpd' make[2]: Entering directory '/usr/local/src/httpd/src' make[2]: *** ターゲット 'all' を make するルールがありません。中止。 make[2]: Leaving directory 'usr/local/src/httpd/src' make[1]: *** [build-sstd] エラー 2 make[1]: Leaving directory 'usr/local/src/httpd' make: *** [build] エラー 2 というエラーが出てしまいます。 Makefileがおかしくてコンパイルエラーになるのは分かりますが、 何せ初めてLinuxを利用するもので、ネットに転がっていた インストール方法をそのまま試しただけでして、 対処法がさっぱり分かりません。 何をどうすれば良いのでしょうか? 例も挙げて頂けると助かります。 宜しくお願い致します。 因みにファイルのダウンロードからのセットアップに かかる時間を知りたいので、元々インストールされている Apacheのアップグレードとかはナシです。

  • Apacheのmake時にエラーが出ます。

    Apacheのmake時にエラーが出ます。 OS:CentOS 5.4上でSSL対応Apcaheをソースからインストールしてるのですが、Apacheのmakeを実行すると、下記のエラーが出ます。 ◎ぐぐったのですけど、解決策を見つけることはできませんでした。 ssl_util_ssl.c: In function ‘SSL_X509_isSGC’: ssl_util_ssl.c:297: error: ‘EXTENDED_KEY_USAGE’ undeclared (first use in this function) ssl_util_ssl.c:297: error: (Each undeclared identifier is reported only once ssl_util_ssl.c:297: error: for each function it appears in.) ssl_util_ssl.c:297: error: ‘sk’ undeclared (first use in this function) ssl_util_ssl.c:306: error: expected expression before ‘)’ token make[3]: *** [ssl_util_ssl.lo] エラー 1 make[3]: ディレクトリ `/usr/local/src/httpd-2.2.15/modules/ssl' から出ます make[2]: *** [all-recursive] エラー 1 make[2]: ディレクトリ `/usr/local/src/httpd-2.2.15/modules/ssl' から出ます make[1]: *** [all-recursive] エラー 1 make[1]: ディレクトリ `/usr/local/src/httpd-2.2.15/modules' から出ます make: *** [all-recursive] エラー 1 ○ここで停止 対応策をご存知の方、教えてください。 ◎コンフィグは、./configure --enable-ssl --with-ssl=/usr/local/ssl で実施してます。 なお、Open_sslは、configure ->make->make installまで完了しています。 Versionは、apache:2.2-15 openssl:0.9.6c です。 宜しくお願いします。

  • Openldapインストールmake testでエラー

    Openldapのインストールについて質問があります。 1度は、正常にOpenldapのインストールは、成功したのですが Openldapを再インストールしようと思い実行したのですが、 make testで、下記のエラーが表示されました。 Initiating LDAP tests for BDB... Running ./scripts/all... >>>>> Executing all LDAP tests for bdb >>>>> Starting test000-rootdse ... running defines.sh Starting slapd on TCP/IP port 9011... Using ldapsearch to retrieve the root DSE... Waiting 5 seconds for slapd to start... Waiting 5 seconds for slapd to start... Waiting 5 seconds for slapd to start... Waiting 5 seconds for slapd to start... Waiting 5 seconds for slapd to start... Waiting 5 seconds for slapd to start... ldap_bind: Can't contact LDAP server (-1) >>>>> Test failed >>>>> ./scripts/test000-rootdse failed (exit 1) make[2]: *** [bdb-yes] Error 1 make[2]: Leaving directory `/var/tmp/src/ldap/openldap-2.2.17/tests' make[1]: *** [test] Error 2 make[1]: Leaving directory `/var/tmp/src/ldap/openldap-2.2.17/tests' make: *** [test] Error 2 ネットで調べたのですが、有力な情報がなかったので、知っている方がいれば教えて頂けたら幸いです。 BerkeleyDB.4.7のパッチは、当てています。 http://www.tail.gr.jp/wiki/?OpenLDAP CPPFLAGS="-I/usr/local/BerkeleyDB.4.7/include -I/usr/loca/ssl/include -I/usr/local/include" export CPPFLAGS LDFLAGS="-L/usr/local/BerkeleyDB.4.7/lib -R/usr/loca/BerkeleyDB.4.7/lib -L/usr/local/ssl/lib -R/usr/local/ssl/lib -L/usr/local/lib -R/usr/local/lib" export LDFLAGS ./configure --enable-crypt make depend make ここまでは、エラー無く通っています。 make test よろしくお願いします。

  • makeができない

    今仕事の課題でsolaris8を触っているのですが、 opensslのmakeでどうしてもエラーが出てしまいます。 エラーは make[3]: *** [lib] Error 1 make[3]: Leaving directory `/export/home/***/openssl-0.9.7g/crypto' make[2]: *** [sub_all] Error 1 make[2]: Leaving directory `/export/home/***/openssl-0.9.7g' make[1]: *** [../libcrypto.a] Error 2 make[1]: Leaving directory `/export/home/***/openssl-0.9.7g/test' make: *** [tests] Error 2 正直かなりなど素人なもので、手順書片手にわからないことがあればgoogleなどで検索してやっています。 どなたかご教授お願いできませんでしょうか?

  • makeコマンドのエラーについて(

    UNIX(Linux)系のOSやC言語には不慣れなのですが、よろしくお願いします。 普段はWindows7(Home Ed.)を利用しているのですが、 いくつかのlinux系のソフトを利用する際にcygwinも利用しています。 ========================================================== cygwinにソフトウェアをインストールしようとする際に、 ときどき遭遇するエラーなのですが 仮にsoftware.tar.gzというソースファイルからインストールしようとして、 > gunzip -c software.tar.gz | tar xvf - > cd software > ./configure > make ..... make: *** [all-recursive] error というエラーが生じて、makeが通らない時があります。 ========================================================= これまで何度か、どういうエラーなのか調べようとする度に挫折し、 何回かやり直している内に、たまたまmakeがすんなり通って インストールできてしまったりしていたので、 なんとなくうやむやにしていました。 そもそも、この"all-recursive"に全くピンとこないのですが、 これはどういった場合に生じるエラーを示しているのでしょうか? recursive(再帰的な)だから、関数かなにかの呼び出しに失敗している、 とかそういうことなのでしょうか? エラーの内容はケースバイケースだし、 漠然とした質問になって申し訳ないのですが、 ちょっとしたアドバイスでもいいので、ご回答をお願いします。

  • gphoto2のコンパイル

    現在以下のものをダウンロードしてコンパイルを行っています。 gphoto2-2.4.3 libgphoto2-2.4.3 また、コンパイルはcygwin上で行っています。 コンパイルの手順は、./configure, make, make installの順になります。 現在,makeでエラーが発生し先に進むことができません。 オフィシャルページのQ&A等も見たのですが、解決策が分かりません。 何かアドバイスを頂けないでしょうか。 以下エラーの一例です。 $ make(libgphoto2-2.4.3に対して) Creating library file: .libs/adc65.dll.a collect2: ld returned 1 exit status make[3]: *** [adc65.la] Error 1 make[3]: Leaving directory `/home/S-SATORU/libgphoto2-2.4.3/camlibs' make[2]: *** [all-recursive] Error 1 make[2]: Leaving directory `/home/S-SATORU/libgphoto2-2.4.3/camlibs' make[1]: *** [all-recursive] Error 1 make[1]: Leaving directory `/home/S-SATORU/libgphoto2-2.4.3' make: *** [all] Error 2