• ベストアンサー
  • すぐに回答を!

Apacheインストール時にエラー

はじめまして。 Solaris10の環境で、OpenSSL9.8lをソースからインストールし Apache2.2.14の所でmakeエラーが発生しました。 Googleで調べたのですが、よくわかりません。 ご存知の方、教えていただけたら幸いです。 ./configure --enable-mods-shared=all--enable-ssl=shared --enable-ssl --with-ssl=/usr/local/ssl --with-included-apr make /usr/local/src/httpd-2.2.14/srclib/apr/libtool --silent --mode=compile gcc -g -O2 -DSOLARIS2=10 -D_POSIX_PTHREAD_SEMANTICS -D_REENTRANT -D_LARGEFILE64_SOURCE -I/usr/local/src/httpd-2.2.14/srclib/pcre -I. -I/usr/local/src/httpd-2.2.14/os/unix -I/usr/local/src/httpd-2.2.14/server/mpm/prefork -I/usr/local/src/httpd-2.2.14/modules/http -I/usr/local/src/httpd-2.2.14/modules/filters -I/usr/local/src/httpd-2.2.14/modules/proxy -I/usr/local/src/httpd-2.2.14/include -I/usr/local/src/httpd-2.2.14/modules/generators -I/usr/local/src/httpd-2.2.14/modules/mappers -I/usr/local/src/httpd-2.2.14/modules/database -I/usr/local/src/httpd-2.2.14/srclib/apr/include -I/usr/local/src/httpd-2.2.14/srclib/apr-util/include -I/usr/local/src/httpd-2.2.14/modules/proxy/../generators -I/usr/local/ssl/include -I/usr/local/src/httpd-2.2.14/modules/ssl -I/usr/local/src/httpd-2.2.14/modules/dav/main -prefer-non-pic -static -c htpasswd.c && touch htpasswd.lo /usr/local/src/httpd-2.2.14/srclib/apr/libtool --silent --mode=link gcc -g -O2 -L/usr/local/ssl/lib -R/usr/local/ssl/lib -L/usr/local/lib:-L/usr/sfw/lib:-L/usr/lib:-L/opt/sfw/lib:-L/usr/local/ssl/lib -o htpasswd htpasswd.lo -lm /usr/local/src/httpd-2.2.14/srclib/pcre/libpcre.la /usr/local/src/httpd-2.2.14/srclib/apr-util/libaprutil-1.la -lexpat -liconv /usr/local/src/httpd-2.2.14/srclib/apr/libapr-1.la -luuid -lsendfile -lrt -lsocket -lnsl -lpthread Undefined first referenced symbol in file atomic_swap_32 /usr/local/src/httpd-2.2.14/srclib/apr/.libs/libapr-1.so atomic_cas_ptr /usr/local/src/httpd-2.2.14/srclib/apr/.libs/libapr-1.so atomic_swap_ptr /usr/local/src/httpd-2.2.14/srclib/apr/.libs/libapr-1.so atomic_inc_32_nv /usr/local/src/httpd-2.2.14/srclib/apr/.libs/libapr-1.so atomic_dec_32_nv /usr/local/src/httpd-2.2.14/srclib/apr/.libs/libapr-1.so atomic_cas_32 /usr/local/src/httpd-2.2.14/srclib/apr/.libs/libapr-1.so ld: fatal: Symbol referencing errors. No output written to .libs/htpasswd collect2: ld returned 1 exit status make[2]: *** [htpasswd] エラー 1 make[2]: ディレクトリ `/usr/local/src/httpd-2.2.14/support' から出ます make[1]: *** [all-recursive] エラー 1 make[1]: ディレクトリ `/usr/local/src/httpd-2.2.14/support' から出ます make: *** [all-recursive] エラー 1 よろしくお願いします。

共感・応援の気持ちを伝えよう!

  • 回答数1
  • 閲覧数1336
  • ありがとう数2

質問者が選んだベストアンサー

  • ベストアンサー
  • 回答No.1
noname#227025
noname#227025

Solaris 10 の詳細なバージョンはどうなっていますか? (詳細なバージョンは /etc/release に書かれています。) また、最新のパッチは適用した状態になっていますか? 下記 URL に 5/08 にアップグレードしたら解決できたとの投稿があります。 http://groups.google.com/group/comp.unix.solaris/browse_thread/thread/075d3c813c522249 > We got it!!! > An Upgrade to Solaris 10 x86 5/08 did the trick but don't ask me why. ちなみに私の環境(8/07 かつ最新のパッチを適用済み) では特に問題なく make が通りました。

共感・感謝の気持ちを伝えよう!

質問者からのお礼

xinuさん、 この連休で、色々検証してました。 現状使用していたSolaris10ですが、書籍に付属したソフトで かなり古かったです。その環境で、SunStudio12とUp1を当てて 確認したところ、やはり、make でエラーでした。 今度は、最新のSolarisをダウンロードし、確認したところ エラーも無くmakeが通りました。 本当に、ありがとうございました。

関連するQ&A

  • Apache インストール時のエラーについて

    CentOS4.6 に Apacheをインストールしようとしているのですが、make と make install で いつも このようなエラーがでて。。どうも上手いこといきません。  まだ初心者なので訳してみてもよくわからず、調べた結果、 /usr/local/apache/bin/ に apachectl が何度も挑戦しても、 作成されません。なぜでしょう・・・助けてください。 ※元々、OSインストール時にhttpdがインストールされてましたので、 yum remove httpdを実行しました。(元々のでも出来なかったので) 後、最終的にしたいことは、htdocsを作成してCGIとかperl とかで勉強したいのですが、apacheが、、、お願いします。 /usr/lib/libexpat.so: could not read symbols: File in wrong format collect2: ld returned 1 exit status make[3]: *** [libaprutil-1.la] Error 1 make[3]: Leaving directory `/usr/local/src/httpd-2.2.8/srclib/apr-util' make[2]: *** [all-recursive] Error 1 make[2]: Leaving directory `/usr/local/src/httpd-2.2.8/srclib/apr-util' make[1]: *** [all-recursive] Error 1 make[1]: Leaving directory `/usr/local/src/httpd-2.2.8/srclib' make: *** [all-recursive] Error 1

  • Apace2のインストールでエラー

    VMware PlayerにCentOS5をインストールしてApache2をソースファイルからインストールしようとしているのですが、Apacheのインストールができません。状況は下記の通りです。 # wget ftp://ftp.riken.jp/net/apache/httpd/httpd-2.2.4.tar.gz # tar -xvzf httpd-2.2.4.tar.gz # cd httpd-2.2.4 ここでapr/apr-utilをアップグレードする必要があるということで http://httpd.apache.org/docs/2.2/ja/install.html の「apr/apr-util >= 1.2」を参考にしながら下記の操作を行いました。 # cd srclib/apr # ./configure --prefix=/usr/local/apr-httpd/ # make # make install # make clean # cd ../apr-util # ./configure --prefix=/usr/local/apr-util-httpd/ --with-apr=/usr/local/apr-httpd/ # make # make install # make clean # cd ../../ # ./configure --with-apr=/usr/local/apr-httpd/ --with-apr-util=/usr/local/apr-util-httpd/ (省略) /usr/local/apr-httpd//build-1/libtool --silent --mode=link gcc -g -O2 -pthread -L/usr/local/apr-util-httpd//lib -o htpasswd htpasswd.lo -lm /home/minoru/dl_app/httpd-2.2.4/srclib/pcre/libpcre.la /usr/local/apr-util-httpd//lib/libaprutil-1.la -lexpat /usr/local/apr-httpd//lib/libapr-1.la -lrt -lcrypt -lpthread -ldl /usr/local/apr-util-httpd//lib/libexpat.so: undefined reference to `XmlSizeOfUnknownEncoding' /usr/local/apr-util-httpd//lib/libexpat.so: undefined reference to `XmlInitUnknownEncoding' /usr/local/apr-util-httpd//lib/libexpat.so: undefined reference to `XmlInitEncodingNS' /usr/local/apr-util-httpd//lib/libexpat.so: undefined reference to `XmlUtf8Encode' /usr/local/apr-util-httpd//lib/libexpat.so: undefined reference to `XmlGetUtf8InternalEncoding' /usr/local/apr-util-httpd//lib/libexpat.so: undefined reference to `XmlGetUtf8InternalEncodingNS' /usr/local/apr-util-httpd//lib/libexpat.so: undefined reference to `XmlPrologStateInit' /usr/local/apr-util-httpd//lib/libexpat.so: undefined reference to `XmlParseXmlDeclNS' /usr/local/apr-util-httpd//lib/libexpat.so: undefined reference to `XmlInitUnknownEncodingNS' /usr/local/apr-util-httpd//lib/libexpat.so: undefined reference to `XmlParseXmlDecl' /usr/local/apr-util-httpd//lib/libexpat.so: undefined reference to `XmlInitEncoding' /usr/local/apr-util-httpd//lib/libexpat.so: undefined reference to `XmlPrologStateInitExternalEntity' collect2: ld returned 1 exit status make[2]: *** [htpasswd] エラー 1 make[2]: ディレクトリ `/home/minoru/dl_app/httpd-2.2.4/support' から出ます make[1]: *** [all-recursive] エラー 1 make[1]: ディレクトリ `/home/minoru/dl_app/httpd-2.2.4/support' から出ます make: *** [all-recursive] エラー 1 どなたかわかる方、御教示願います。

  • Apacheのmake時にエラーが出ます。

    Apacheのmake時にエラーが出ます。 OS:CentOS 5.4上でSSL対応Apcaheをソースからインストールしてるのですが、Apacheのmakeを実行すると、下記のエラーが出ます。 ◎ぐぐったのですけど、解決策を見つけることはできませんでした。 ssl_util_ssl.c: In function ‘SSL_X509_isSGC’: ssl_util_ssl.c:297: error: ‘EXTENDED_KEY_USAGE’ undeclared (first use in this function) ssl_util_ssl.c:297: error: (Each undeclared identifier is reported only once ssl_util_ssl.c:297: error: for each function it appears in.) ssl_util_ssl.c:297: error: ‘sk’ undeclared (first use in this function) ssl_util_ssl.c:306: error: expected expression before ‘)’ token make[3]: *** [ssl_util_ssl.lo] エラー 1 make[3]: ディレクトリ `/usr/local/src/httpd-2.2.15/modules/ssl' から出ます make[2]: *** [all-recursive] エラー 1 make[2]: ディレクトリ `/usr/local/src/httpd-2.2.15/modules/ssl' から出ます make[1]: *** [all-recursive] エラー 1 make[1]: ディレクトリ `/usr/local/src/httpd-2.2.15/modules' から出ます make: *** [all-recursive] エラー 1 ○ここで停止 対応策をご存知の方、教えてください。 ◎コンフィグは、./configure --enable-ssl --with-ssl=/usr/local/ssl で実施してます。 なお、Open_sslは、configure ->make->make installまで完了しています。 Versionは、apache:2.2-15 openssl:0.9.6c です。 宜しくお願いします。

  • Openldapインストールmakeでエラー

    Solaris10にOpenldapのインストールがうまく行きません。 make時でエラーになります。 色々、Googleで調べてしているのですが結局うまくいきませんでした。 教えていた頂けたら幸いです。 事前にインストールしたソフト BerkeleyDB4.7.25 openssl0.98l cyrus-sasl-2.1.21 cd openldap-2.4.16 CPPFLAGS="-I/usr/local/BerkeleyDB.4.7/include" LDFLAGS="-L/usr/local/BerkeleyDB.4.7/lib -R/usr/local/BerkeleyDB.4.7/lib" ./configure make depend make (cd .libs && rm -f libldap.la && ln -s ../libldap.la libldap.la) gcc -g -O2 -I../../include -I../../include -I/usr/local/BerkeleyDB.4.7/include -c -o apitest.o apitest.c /bin/sh ../../libtool --mode=link gcc -static -g -O2 -L/usr/local/BerkeleyDB.4.7/lib -R/usr/local/BerkeleyDB.4.7/lib -o apitest apitest.o libldap.la ../../libraries/liblber/liblber.la ../../libraries/liblutil/liblutil.a -lsasl2 -lgss -lssl -lcrypto -lresolv -lgen -lnsl -lsocket gcc -g -O2 -o apitest apitest.o -L/usr/local/BerkeleyDB.4.7/lib ./.libs/libldap.a /work/src/openldap-2.4.16/libraries/liblber/.libs/liblber.a -L/usr/local/lib:-L/usr/local/ssl/lib:-L/usr/sfw/lib:-L/usr/lib:-L/opt/sfw/lib:-L/usr/ccs/lib:-L/usr/local/BerkeleyDB4.7/lib ../../libraries/liblber/.libs/liblber.a ../../libraries/liblutil/liblutil.a /usr/local/lib/libsasl2.so -ldl -lgss -lssl -lcrypto -lresolv -lgen -lnsl -lsocket -R/usr/local/lib -R/usr/local/lib -R/usr/local/BerkeleyDB.4.7/lib Undefined first referenced symbol in file BIO_set_flags ./.libs/libldap.a(tls_o.o) BIO_clear_flags ./.libs/libldap.a(tls_o.o) SSL_CTX_set_info_callback ./.libs/libldap.a(tls_o.o) ld: fatal: Symbol referencing errors. No output written to apitest collect2: ld returned 1 exit status make[2]: *** [apitest] エラー 1 make[2]: ディレクトリ `/work/src/openldap-2.4.16/libraries/libldap' から出ます make[1]: *** [all-common] エラー 1 make[1]: ディレクトリ `/work/src/openldap-2.4.16/libraries' から出ます make: *** [all-common] エラー 1 勉強不足で申し訳ありませんが、よろしくお願いします。

  • Apacheのインストール

    相当初心者で申し訳ありませんが、Fedora Core5より 新規でApacheをインストールする事が出来ません。 tar zxvf apache_1.3.36.tar.gz mv apache_1.3.36 httpd cd ./httpd ./configure make make install としたところ、 make[1]: Entering directory '/usr/local/src/httpd' make[2]: Entering directory '/usr/local/src/httpd/src' make[2]: *** ターゲット 'all' を make するルールがありません。中止。 make[2]: Leaving directory 'usr/local/src/httpd/src' make[1]: *** [build-sstd] エラー 2 make[1]: Leaving directory 'usr/local/src/httpd' make: *** [build] エラー 2 というエラーが出てしまいます。 Makefileがおかしくてコンパイルエラーになるのは分かりますが、 何せ初めてLinuxを利用するもので、ネットに転がっていた インストール方法をそのまま試しただけでして、 対処法がさっぱり分かりません。 何をどうすれば良いのでしょうか? 例も挙げて頂けると助かります。 宜しくお願い致します。 因みにファイルのダウンロードからのセットアップに かかる時間を知りたいので、元々インストールされている Apacheのアップグレードとかはナシです。

  • RHE-r5.3にapache2をソースからインストールできない

    RHE-r5.3にapache2をソースからインストールできない はじめまして。 現在、ソースファイルからapache2(httpd-2.0.46)をインストールするとmake時点で 下記エラーが出力され、ソースコードをコンパイルできません…。 エラー内容より『[apr_socket_opt_set]関数の[SCTP_NODELAY]が宣言されてない』と 言うようなエラーになるかと思いますが、具体的にはどのように対応してよいか分かりません… お手数ですが、どなたかご教授いただけたらと思います。 ■エラー出力(抜粋) make[4]: ディレクトリ `/usr/local/src/httpd-2.0.46/srclib/apr/network_io/unix' に入ります /bin/sh /usr/local/src/httpd-2.0.46/srclib/apr/libtool --silent --mode=compile gcc -g -O2 -pthread -DHAVE_CONFIG_H -DLINUX=2 -D_REENTRANT -D_GNU_SOURCE -I../../include -I../../include/arch/unix -I../../include/arch/unix -c sockopt.c && touch sockopt.lo sockopt.c: In function 'apr_socket_opt_set': sockopt.c:254: error: 'SCTP_NODELAY' undeclared (first use in this function) sockopt.c:254: error: (Each undeclared identifier is reported only once sockopt.c:254: error: for each function it appears in.) make[4]: *** [sockopt.lo] エラー 1 make[4]: ディレクトリ `/usr/local/src/httpd-2.0.46/srclib/apr/network_io/unix' から出ます make[3]: *** [all-recursive] エラー 1 make[3]: ディレクトリ `/usr/local/src/httpd-2.0.46/srclib/apr/network_io/unix' から出ます make[2]: *** [all-recursive] エラー 1 make[2]: ディレクトリ `/usr/local/src/httpd-2.0.46/srclib/apr' から出ます make[1]: *** [all-recursive] エラー 1 make[1]: ディレクトリ `/usr/local/src/httpd-2.0.46/srclib' から出ます make: *** [all-recursive] エラー 1 ■PC環境 OS:Red Hat Enterprise Linux Server release 5.3 apche:httpd-2.0.46 ■エラーが出力されている関数(http://apr.apache.org/docs/apr/0.9/group__apr__network__io.html#g08f5e505fa611005f56c12783269ffa9 より) apr_status_t apr_socket_opt_set ( apr_socket_t * sock, apr_int32_t opt, apr_int32_t on ) Setup socket options for the specified socket Parameters: sock The socket to set up. opt The option we would like to configure. One of: APR_SO_DEBUG -- turn on debugging information APR_SO_KEEPALIVE -- keep connections active APR_SO_LINGER -- lingers on close if data

  • Openldapインストールmake testでエラー

    Openldapのインストールについて質問があります。 1度は、正常にOpenldapのインストールは、成功したのですが Openldapを再インストールしようと思い実行したのですが、 make testで、下記のエラーが表示されました。 Initiating LDAP tests for BDB... Running ./scripts/all... >>>>> Executing all LDAP tests for bdb >>>>> Starting test000-rootdse ... running defines.sh Starting slapd on TCP/IP port 9011... Using ldapsearch to retrieve the root DSE... Waiting 5 seconds for slapd to start... Waiting 5 seconds for slapd to start... Waiting 5 seconds for slapd to start... Waiting 5 seconds for slapd to start... Waiting 5 seconds for slapd to start... Waiting 5 seconds for slapd to start... ldap_bind: Can't contact LDAP server (-1) >>>>> Test failed >>>>> ./scripts/test000-rootdse failed (exit 1) make[2]: *** [bdb-yes] Error 1 make[2]: Leaving directory `/var/tmp/src/ldap/openldap-2.2.17/tests' make[1]: *** [test] Error 2 make[1]: Leaving directory `/var/tmp/src/ldap/openldap-2.2.17/tests' make: *** [test] Error 2 ネットで調べたのですが、有力な情報がなかったので、知っている方がいれば教えて頂けたら幸いです。 BerkeleyDB.4.7のパッチは、当てています。 http://www.tail.gr.jp/wiki/?OpenLDAP CPPFLAGS="-I/usr/local/BerkeleyDB.4.7/include -I/usr/loca/ssl/include -I/usr/local/include" export CPPFLAGS LDFLAGS="-L/usr/local/BerkeleyDB.4.7/lib -R/usr/loca/BerkeleyDB.4.7/lib -L/usr/local/ssl/lib -R/usr/local/ssl/lib -L/usr/local/lib -R/usr/local/lib" export LDFLAGS ./configure --enable-crypt make depend make ここまでは、エラー無く通っています。 make test よろしくお願いします。

  • PHP5インストール時にlibphp5.soが作成されない

    こんにちは。 CentOS3、Apache/2.0.46 の環境で、PHP5をインストールしようとしています。 VPSでレンタルしたもので、すでにPHP4が入っていたものを、PHP4.4.4にバージョンアップし使っていましたが、5を使いたいと思いインストールを試みたのですが、configure、makeが終わり、make installの段階で以下のようなエラーがでて終了していまいます。 ーーーーーーーー Installing PHP SAPI module: apache2handler /usr/lib/httpd/build/instdso.sh SH_LIBTOOL='/usr/bin/libtool' libphp5.la /usr/lib/httpd/modules /usr/bin/libtool --mode=install cp libphp5.la /usr/lib/httpd/modules/ cp .libs/libphp5.lai /usr/lib/httpd/modules/libphp5.la cp .libs/libphp5.a /usr/lib/httpd/modules/libphp5.a ranlib /usr/lib/httpd/modules/libphp5.a chmod 644 /usr/lib/httpd/modules/libphp5.a libtool: install: warning: remember to run `libtool --finish /etc/php-5/libs' Warning! dlname not found in /usr/lib/httpd/modules/libphp5.la. Assuming installing a .so rather than a libtool archive. chmod 755 /usr/lib/httpd/modules/libphp5.so chmod: failed to get attributes of `/usr/lib/httpd/modules/libphp5.so': No such file or directory apxs:Error: Command failed with rc=65536 . make: *** [install-sapi] Error 1 ---------------------------- configureは --with-apxs2=/usr/sbin/apxsのオプションだけで行い、とりあえずlibphp5.soファイルを作ろうとしているのですが、作成されません。 ネットをしらべたところ大抵のサイトでは--with-apxs2=/usr/sbin/apxsをだけつけてconfigureすれば生成される、と書かれていたのですが。。。。 よろしくお願いいたします、

  • phpのインストールが上手く行きません

    お世話になります。 phpのインストールが上手く行きません。 make install で下記メッセージが出力し停止します。 [activating module `php4' in /usr/local/apache/conf/httpd.conf] cp libs/libphp4.so /usr/local/apache/libexec/libphp4.so cp: cannot stat `libs/libphp4.so': そのようなファイルやディレクトリはありません apxs:Break: Command failed with rc=1 make[1]: *** [install-sapi] エラー 1 make[1]: 出ます ディレクトリ `/usr/local/src/php-4.2.2' make: *** [install-recursive] エラー 1 phpインストールにあたり下記を実施いたしました。 OSはRedHat7.2です。 > apache1.3.24インストール # ./configure --enable-shared=max --enable-module=so # make # make install # /usr/local/apache/bin/httpd -l Compiled-in modules:  http_core.c  mod_so.c suexec: enabled; valid wrapper /usr/sbin/suexec > php4.2.2インストール $ tar xvzf php-4.2.2.tar.gz $ cd php-4.2.2/ext $ cp /****/php4_mbregex-1.3.1.tar.gz . $ tar xvzf php4_mbregex-1.3.1.tar.gz $ cd .. $ rm configure $ ./buildconf $ ./configure --with-pgsql \ --enable-track-vars \ --with-apxs=/usr/local/apache/bin/apxs \ --enable-versioning \ --enable-trans-sid \ --enable-mbstring \ --enable-mbstr-enc-trans \ --enable-mbregex $ make $ su # make install 最後のmake installが上記エラーをはいて停止してしまいます。 apacheを入れ直したりphpのバージョンを変えて試しましたが駄目でした。 apxsも/usr/local/apache/bin/の中にあります。 なにが悪いのか私ではさっぱり解りませんので どなたかご教授して頂ければと思います。。。 宜しくお願い致します。m(__)m

    • ベストアンサー
    • PHP
  • Apache2.0がX509_freeというエラーでSSLの起動ができない。

    環境は RedHat7.3 httpd-2.0.54.tar.gz openssl-0.9.7g.tar.tar sslはsharedで入れたい 主にhttp://solaris.ddo.jp/apache-ssl.htmlを参照 このサイトでmv cacert.pem cacert.pem.orgはcp cacert.pem.org cacert.pemにした configureは変更(文字数オーバで省略) そしてstartsslで下記エラーです ./apachectl startssl Syntax error on line 251 of /usr/local/apachetest/conf/httpd.conf: Cannot load /usr/local/apachetest/modules/mod_ssl.so into server: /usr/local/apachetest/modules/mod_ssl.so: undefined symbol: X509_free ./apachectl -tはSyntax OK httpd.confの251行目は LoadModule ssl_module modules/mod_ssl.so mod_ssl.soのlddはOKと思います configureから4回やり直したがだめ 最後のインストール時の: ./configure \ --enable-mods-shared=all \ --enable-so \ --prefix=/usr/local/apachetest \ --with-ssl=/usr/local/ssl 1回目からprefixは変更してません。変更ファイルは残るので鍵の再作成はしていません。 sslでない起動はできてます。 どなたか現象の原因や解決策に心当たりがありましたら投稿願います